Target
Peregrin
Ligand
BDBM50564921
Substrate
Meas. Tech.
ChEMBL_2089700 (CHEMBL4770963)
Kd
4080±n/a nM
Citation
 Ghazy, EZeyen, PHerp, DHügle, MSchmidtkunz, KErdmann, FRobaa, DSchmidt, MMorales, ERRomier, CGünther, SJung, MSippl, W Design, synthesis, and biological evaluation of dual targeting inhibitors of histone deacetylase 6/8 and bromodomain BRPF1. Eur J Med Chem 200:0 (2020)  
Target
Name:
Peregrin
Synonyms:
BR140 BRPF1_HUMAN Peregrin | Protein Br140
Type:
PROTEIN
Mol. Mass.:
137524.47
Organism:
Homo sapiens (Human)
Description:
ChEMBL_108054
Residue:
1214
  
Inhibitor
Name:
BDBM50564921
Synonyms:
CHEMBL4792281
Type:
Small organic molecule
Emp. Form.:
C31H34N4O6
Mol. Mass.:
558.6249
SMILES:
COc1ccc(cc1NCc1ccc(OCCCCC(=O)Nc2ccc3n(C)c(=O)c(C)cc3c2)cc1)C(=O)NO
: