Target
Epidermal growth factor receptor
Ligand
BDBM50399540
Substrate
Meas. Tech.
ChEMBL_2089816 (CHEMBL4771079)
IC50
3180±n/a nM
Citation
 Nan, XZhang, JLi, HJWu, RFang, SBZhang, ZZWu, YC Design, synthesis and biological evaluation of novel N-sulfonylamidine-based derivatives as c-Met inhibitors via Cu-catalyzed three-component reaction. Eur J Med Chem 200:0 (2020)  
Target
Name:
Epidermal growth factor receptor
Synonyms:
EGF Receptor Substrate EGFR_HUMAN ERBB1 Epidermal Growth Factor Receptor erbB-1 Epidermal growth factor receptor (EGFR) HER1 Proto-oncogene c-ErbB-1 Tyrosine-Protein Kinase ErbB-1
Type:
Receptor Kinase Domain
Mol. Mass.:
134279.59
Organism:
Homo sapiens (Human)
Description:
P00533
Residue:
1210
  
Inhibitor
Name:
BDBM50399540
Synonyms:
FORETINIB US10882853, Compound For-Oxide
Type:
Small organic molecule
Emp. Form.:
C34H34F2N4O6
Mol. Mass.:
632.6538
SMILES:
COc1cc2c(Oc3ccc(NC(=O)C4(CC4)C(=O)Nc4ccc(F)cc4)cc3F)ccnc2cc1OCCCN1CCOCC1
: