Target
Muscarinic acetylcholine receptor M2
Ligand
BDBM50129395
Substrate
Meas. Tech.
ChEBML_139760
Ki
15000±n/a nM
Citation
 Ogino, YOhtake, NKobayashi, KKimura, TFujikawa, THasegawa, TNoguchi, KMase, T Muscarinic M(3) receptor antagonists with (2R)-2-[(1R)-3,3-difluorocyclopentyl]-2-hydroxyphenylacetamide Structures. Part 2. Bioorg Med Chem Lett 13:2167-72 (2003)  
Target
Name:
Muscarinic acetylcholine receptor M2
Synonyms:
ACM2_HUMAN Cholinergic, muscarinic M2 Muscarinic acetylcholine receptor M2 and M5 | RecName: Full=Muscarinic acetylcholine receptor M2
Type:
GPCR
Mol. Mass.:
51730.61
Organism:
Homo sapiens (Human)
Description:
P08172
Residue:
466
  
Inhibitor
Name:
BDBM50129395
Synonyms:
(R)-2-((R)-3,3-Difluoro-cyclopentyl)-2-hydroxy-2-phenyl-N-piperidin-4-yl-acetamide | CHEMBL69383
Type:
Small organic molecule
Emp. Form.:
C18H24F2N2O2
Mol. Mass.:
338.3922
SMILES:
O[C@@]([C@@H]1CCC(F)(F)C1)(C(=O)NC1CCNCC1)c1ccccc1
: