Target
Muscarinic acetylcholine receptor M3
Ligand
BDBM50129393
Substrate
Meas. Tech.
ChEBML_138705
Ki
8.3±n/a nM
Citation
 Ogino, YOhtake, NKobayashi, KKimura, TFujikawa, THasegawa, TNoguchi, KMase, T Muscarinic M(3) receptor antagonists with (2R)-2-[(1R)-3,3-difluorocyclopentyl]-2-hydroxyphenylacetamide Structures. Part 2. Bioorg Med Chem Lett 13:2167-72 (2003)  
Target
Name:
Muscarinic acetylcholine receptor M3
Synonyms:
ACM3_HUMAN Cholinergic, muscarinic M3 Muscarinic receptor M3 | RecName: Full=Muscarinic acetylcholine receptor M3
Type:
Enzyme
Mol. Mass.:
66151.03
Organism:
Homo sapiens (Human)
Description:
P20309
Residue:
590
  
Inhibitor
Name:
BDBM50129393
Synonyms:
(R)-1-(4-Amino-4-methyl-piperidin-1-yl)-2-((R)-3,3-difluoro-cyclopentyl)-2-hydroxy-2-phenyl-ethanone | CHEMBL68609
Type:
Small organic molecule
Emp. Form.:
C19H26F2N2O2
Mol. Mass.:
352.4187
SMILES:
CC1(N)CCN(CC1)C(=O)[C@@](O)([C@@H]1CCC(F)(F)C1)c1ccccc1
: