Target
Beta-3 adrenergic receptor
Ligand
BDBM50129443
Substrate
Meas. Tech.
ChEBML_41707
EC50
120±n/a nM
Citation
 Sum, FWWong, VHan, SLargis, EMulvey, RTillett, J Cyclic amine sulfonamides as linkers in the design and synthesis of novel human beta(3) adrenergic receptor agonists. Bioorg Med Chem Lett 13:2191-4 (2003)  
Target
Name:
Beta-3 adrenergic receptor
Synonyms:
ADRB3 ADRB3_HUMAN Beta-2 adrenergic receptor and beta-3 adrenergic receptor Beta-3 adrenoreceptor | adrenergic Beta3
Type:
G Protein-Coupled Receptor (GPCR)
Mol. Mass.:
43534.88
Organism:
Homo sapiens (Human)
Description:
Residue:
408
  
Inhibitor
Name:
BDBM50129443
Synonyms:
4-{(S)-2-Hydroxy-3-[1-(4-methoxy-benzenesulfonyl)-piperidin-4-ylamino]-propoxy}-1,3-dihydro-benzoimidazol-2-one | CHEMBL68685
Type:
Small organic molecule
Emp. Form.:
C22H28N4O6S
Mol. Mass.:
476.546
SMILES:
COc1ccc(cc1)S(=O)(=O)N1CCC(CC1)NC[C@H](O)COc1cccc2[nH]c(=O)[nH]c12
: