Target
Vasopressin V2 receptor
Ligand
BDBM50129469
Substrate
Meas. Tech.
ChEBML_215009
IC50
13±n/a nM
Citation
 Sum, FWDusza, JSantos, EDGrosu, GReich, MDu, XAlbright, JDChan, PCoupet, JRu, XMazandarani, HSaunders, T Structure-activity study of novel tricyclic benzazepine arginine vasopressin antagonists. Bioorg Med Chem Lett 13:2195-8 (2003)  
Target
Name:
Vasopressin V2 receptor
Synonyms:
AVPR V2 Avpr2 V2R_RAT Vasopressin receptor
Type:
G-protein coupled receptor
Mol. Mass.:
40761.85
Organism:
Rattus norvegicus (Rat)
Description:
Residue:
371
  
Inhibitor
Name:
BDBM50129469
Synonyms:
CHEMBL304060 | N-[4-(5H,11H-Benzo[e]pyrrolo[1,2-a][1,4]diazepine-10-carbonyl)-phenyl]-2-methylsulfanyl-benzamide
Type:
Small organic molecule
Emp. Form.:
C27H23N3O2S
Mol. Mass.:
453.555
SMILES:
CSc1ccccc1C(=O)Nc1ccc(cc1)C(=O)N1Cc2cccn2Cc2ccccc12
: