Target
Vasopressin V1a receptor
Ligand
BDBM50129464
Substrate
Meas. Tech.
ChEBML_214555
IC50
2±n/a nM
Citation
 Sum, FWDusza, JSantos, EDGrosu, GReich, MDu, XAlbright, JDChan, PCoupet, JRu, XMazandarani, HSaunders, T Structure-activity study of novel tricyclic benzazepine arginine vasopressin antagonists. Bioorg Med Chem Lett 13:2195-8 (2003)  
Target
Name:
Vasopressin V1a receptor
Synonyms:
Avpr1a VASOPRESSIN V1A Vasopressin V1a receptor | Vasopressin receptor
Type:
Enzyme Catalytic Domain
Mol. Mass.:
47674.81
Organism:
RAT
Description:
VASOPRESSIN V1A AVPR1A RAT::P30560
Residue:
424
  
Inhibitor
Name:
BDBM50129464
Synonyms:
CHEMBL71355 | N-[4-(5H,11H-Benzo[e]pyrrolo[1,2-a][1,4]diazepine-10-carbonyl)-phenyl]-2-bromo-benzamide
Type:
Small organic molecule
Emp. Form.:
C26H20BrN3O2
Mol. Mass.:
486.36
SMILES:
Brc1ccccc1C(=O)Nc1ccc(cc1)C(=O)N1Cc2cccn2Cc2ccccc12
: