Target
Vasopressin V2 receptor
Ligand
BDBM50065124
Substrate
Meas. Tech.
ChEBML_215009
IC50
1.5±n/a nM
Citation
 Sum, FWDusza, JSantos, EDGrosu, GReich, MDu, XAlbright, JDChan, PCoupet, JRu, XMazandarani, HSaunders, T Structure-activity study of novel tricyclic benzazepine arginine vasopressin antagonists. Bioorg Med Chem Lett 13:2195-8 (2003)  
Target
Name:
Vasopressin V2 receptor
Synonyms:
AVPR V2 Avpr2 V2R_RAT Vasopressin receptor
Type:
G-protein coupled receptor
Mol. Mass.:
40761.85
Organism:
Rattus norvegicus (Rat)
Description:
Residue:
371
  
Inhibitor
Name:
BDBM50065124
Synonyms:
CHEMBL68085 | N-[4-(5H,11H-Benzo[e]pyrrolo[1,2-a][1,4]diazepine-10-carbonyl)-phenyl]-5-fluoro-2-methyl-benzamide
Type:
Small organic molecule
Emp. Form.:
C27H22FN3O2
Mol. Mass.:
439.4809
SMILES:
Cc1ccc(F)cc1C(=O)Nc1ccc(cc1)C(=O)N1Cc2cccn2Cc2ccccc12
: