Target
Histone deacetylase 7
Ligand
BDBM50446481
Substrate
Meas. Tech.
ChEMBL_2090264 (CHEMBL4771527)
Ki
36±n/a nM
Citation
 Ho, TCSChan, AHYGanesan, A Thirty Years of HDAC Inhibitors: 2020 Insight and Hindsight. J Med Chem 63:12460-12484 (2020)  
Target
Name:
Histone deacetylase 7
Synonyms:
HD7 HDAC7A Histone acetylase 7 (HDAC7) Human HDAC7
Type:
Chromatin regulator; hydrolase; repressor
Mol. Mass.:
102942.62
Organism:
Homo sapiens (Human)
Description:
Q8WUI4
Residue:
952
  
Inhibitor
Name:
BDBM50446481
Synonyms:
CHEMBL3110004 US10722597, Compound TMP-269
Type:
Small organic molecule
Emp. Form.:
C25H21F3N4O3S
Mol. Mass.:
514.519
SMILES:
FC(F)(F)c1nc(no1)-c1cccc(c1)C(=O)NCC1(CCOCC1)c1nc(cs1)-c1ccccc1
: