Target
Neuropeptide FF receptor 2
Ligand
BDBM50037567
Substrate
Meas. Tech.
ChEMBL_2090955 (CHEMBL4772218)
Ki
2.0±n/a nM
Citation
 Nguyen, TMarusich, JLi, JXZhang, Y Neuropeptide FF and Its Receptors: Therapeutic Applications and Ligand Development. J Med Chem 63:12387-12402 (2020)  
Target
Name:
Neuropeptide FF receptor 2
Synonyms:
G-protein coupled receptor 74 NPFF2_RAT Npff2 Npgpr
Type:
Enzyme Catalytic Domain
Mol. Mass.:
47725.66
Organism:
RAT
Description:
NPFF2 0 RAT::Q9EQD2
Residue:
417
  
Inhibitor
Name:
BDBM50037567
Synonyms:
2-[(Pyrrolidine-2-carbonyl)-amino]-pentanedioic acid 5-amide 1-{[1-(1-carbamoyl-2-phenyl-ethylcarbamoyl)-4-guanidino-butyl]-amide} | CHEMBL414263
Type:
Small organic molecule
Emp. Form.:
C55H78N14O11
Mol. Mass.:
1111.295
SMILES:
CC(C)C[C@H](NC(=O)[C@H](N)Cc1ccc(O)cc1)C(=O)N(C)[C@@H](Cc1ccccc1)C(=O)N[C@@H](CCC(N)=O)C(=O)N1CCC[C@H]1C(=O)N[C@@H](CCC(N)=O)C(=O)N[C@@H](CCCNC(N)=N)C(=O)N[C@@H](Cc1ccccc1)C(N)=O
: