Target
Neuropeptide FF receptor 2
Ligand
BDBM50037573
Substrate
Meas. Tech.
ChEMBL_2090955 (CHEMBL4772218)
Ki
25±n/a nM
Citation
 Nguyen, TMarusich, JLi, JXZhang, Y Neuropeptide FF and Its Receptors: Therapeutic Applications and Ligand Development. J Med Chem 63:12387-12402 (2020)  
Target
Name:
Neuropeptide FF receptor 2
Synonyms:
G-protein coupled receptor 74 NPFF2_RAT Npff2 Npgpr
Type:
Enzyme Catalytic Domain
Mol. Mass.:
47725.66
Organism:
RAT
Description:
NPFF2 0 RAT::Q9EQD2
Residue:
417
  
Inhibitor
Name:
BDBM50037573
Synonyms:
(S)-2-[((S)-Pyrrolidine-2-carbonyl)-amino]-pentanedioic acid 5-amide 1-{[(S)-1-((S)-1-carbamoyl-2-phenyl-ethylcarbamoyl)-4-guanidino-butyl]-amide} | CHEMBL326770
Type:
Small organic molecule
Emp. Form.:
C25H39N9O5
Mol. Mass.:
545.6345
SMILES:
NC(=O)CC[C@H](NC(=O)[C@@H]1CCCN1)C(=O)N[C@@H](CCCNC(N)=N)C(=O)N[C@@H](Cc1ccccc1)C(N)=O
: