Target
Dipeptidyl peptidase 4
Ligand
BDBM50129895
Substrate
Meas. Tech.
ChEMBL_53208 (CHEMBL664029)
IC50
18600±n/a nM
Citation
 Villhauer, EBBrinkman, JANaderi, GBBurkey, BFDunning, BEPrasad, KMangold, BLRussell, MEHughes, TE 1-[[(3-hydroxy-1-adamantyl)amino]acetyl]-2-cyano-(S)-pyrrolidine: a potent, selective, and orally bioavailable dipeptidyl peptidase IV inhibitor with antihyperglycemic properties. J Med Chem 46:2774-89 (2003)  
Target
Name:
Dipeptidyl peptidase 4
Synonyms:
ADABP Adenosine deaminase complexing protein 2 CD_antigen=CD26 DPP4 DPPIV Dipeptidyl peptidase 4 (DPP IV) Dipeptidyl peptidase 4 (DPP4) Dipeptidyl peptidase 4 membrane form Dipeptidyl peptidase IV Dipeptidyl peptidase IV (DDP-IV) Dipeptidyl peptidase IV membrane form Dipeptidyl peptidase-IV (DPP-4) T-cell activation antigen CD26 | TP103
Type:
Enzyme
Mol. Mass.:
88271.01
Organism:
Homo sapiens (Human)
Description:
P27487
Residue:
766
  
Inhibitor
Name:
BDBM50129895
Synonyms:
1-(2-Cyclohexyl-2-cyclohexylamino-acetyl)-pyrrolidine-2-carbonitrile | CHEMBL330623
Type:
Small organic molecule
Emp. Form.:
C19H31N3O
Mol. Mass.:
317.4689
SMILES:
O=C([C@@H](NC1CCCCC1)C1CCCCC1)N1CCC[C@H]1C#N
: