Target
Fibroblast growth factor receptor 1
Ligand
BDBM50565310
Substrate
Meas. Tech.
ChEMBL_2091387 (CHEMBL4772650)
Kd
76±n/a nM
Citation
 Duan, YWang, JZhu, STu, ZCZhang, ZChan, SDing, K Design, synthesis, and Structure-Activity Relationships (SAR) of 3-vinylindazole derivatives as new selective tropomyosin receptor kinases (Trk) inhibitors. Eur J Med Chem 203:0 (2020)  
Target
Name:
Fibroblast growth factor receptor 1
Synonyms:
BFGFR Basic fibroblast growth factor receptor 1 (FGFR1) CEK FGFR-1 FGFR-1, (FL) FGFR1_HUMAN FLT2 Fibroblast growth factor receptor 1 (FGFR-1) Fms-like tyrosine kinase 2 N-sam bFGF-R | c-fgr
Type:
Receptor
Mol. Mass.:
91861.70
Organism:
Homo sapiens (Human)
Description:
P11362
Residue:
822
  
Inhibitor
Name:
BDBM50565310
Synonyms:
CHEMBL4792981
Type:
Small organic molecule
Emp. Form.:
C22H18F2N4
Mol. Mass.:
376.4019
SMILES:
C[C@@H](Nc1ccc2[nH]nc(\C=C\c3ccccn3)c2c1)c1cc(F)cc(F)c1
: