Target
C-X-C chemokine receptor type 4
Ligand
BDBM50565505
Substrate
Meas. Tech.
ChEMBL_2092195 (CHEMBL4773458)
IC50
1.8±n/a nM
Citation
 Li, ZWang, XLin, YWang, YWu, SXia, KXu, CMa, HZheng, JLuo, LZhu, FHe, SZhang, X Design, synthesis, and evaluation of pyrrolidine based CXCR4 antagonists with in vivo anti-tumor metastatic activity. Eur J Med Chem 205:0 (2020)  
Target
Name:
C-X-C chemokine receptor type 4
Synonyms:
C-X-C chemokine receptor type 4 CD_antigen=CD184 CXCR-4 CXCR4_HUMAN Fusin LCR1 Leukocyte-derived seven transmembrane domain receptor SDF-1 receptor | Stromal cell-derived factor 1 receptor
Type:
Enzyme
Mol. Mass.:
39754.61
Organism:
Homo sapiens (Human)
Description:
P61073
Residue:
352
  
Inhibitor
Name:
BDBM50565505
Synonyms:
CHEMBL4777386
Type:
Small organic molecule
Emp. Form.:
C22H29N7
Mol. Mass.:
391.5126
SMILES:
CN1CCN(CC1)c1nc(C)nc(CN2CCC[C@H]2c2ncccc2C)c1C#N
: