Target
5-hydroxytryptamine receptor 1A
Ligand
BDBM50130152
Substrate
Meas. Tech.
ChEMBL_892 (CHEMBL835002)
Ki
7.5±n/a nM
Citation
 Takeuchi, KKohn, TJHonigschmidt, NARocco, VPSpinazze, PGKoch, DJAtkinson, STHertel, LWNelson, DLWainscott, DBAhmad, LJShaw, JThrelkeld, PGWong, DT Advances Toward new antidepressants beyond SSRIs: 1-aryloxy-3-piperidinylpropan-2-ols with dual 5-HT(1A) receptor antagonism/SSRI activities. Part 2. Bioorg Med Chem Lett 13:2393-7 (2003)  
Target
Name:
5-hydroxytryptamine receptor 1A
Synonyms:
5-HT-1A 5-hydroxytryptamine receptor 1A (5-HT-1A) ADRB2RL1 Dopamine D2 receptor and serotonin 1a receptor HTR1A | Serotonin receptor 1A
Type:
Mol. Mass.:
46122.49
Organism:
Homo sapiens (Human)
Description:
Residue:
422
  
Inhibitor
Name:
BDBM50130152
Synonyms:
(S)-1-(1H-indol-4-yloxy)-3-((2S,4R)-4-(6-fluorobenzo[b]thiophen-2-yl)-2-methylpiperidin-1-yl)propan-2-ol CHEMBL309396
Type:
Small organic molecule
Emp. Form.:
C25H27FN2O2S
Mol. Mass.:
438.557
SMILES:
C[C@H]1C[C@@H](CCN1C[C@H](O)COc1cccc2[nH]ccc12)c1cc2ccc(F)cc2s1
: