Target
Melanocortin receptor 4
Ligand
BDBM50565818
Substrate
Meas. Tech.
ChEMBL_2093917 (CHEMBL4775180)
Ki
0.041687±n/a nM
Citation
 Martin, CGimenez, LEWilliams, SYJing, YWu, YHollanders, CVan der Poorten, OGonzalez, SVan Holsbeeck, KPreviti, SLamouroux, AZhao, STourwé, DStevens, RCCone, RDBallet, S Structure-Based Design of Melanocortin 4 Receptor Ligands Based on the SHU-9119-hMC4R Cocrystal Structure?. J Med Chem 64:357-369 (2021)  
Target
Name:
Melanocortin receptor 4
Synonyms:
MC4-R MC4R_HUMAN Melanocortin receptor 4 (MC-4) Melanocortin receptor 4 (MC4R)
Type:
Enzyme
Mol. Mass.:
36949.50
Organism:
Homo sapiens (Human)
Description:
P32245
Residue:
332
  
Inhibitor
Name:
BDBM50565818
Synonyms:
CHEMBL4776915
Type:
Small organic molecule
Emp. Form.:
C53H70N16O9
Mol. Mass.:
1075.2247
SMILES:
CC(=O)N[C@H](CCCN)C(=O)N[C@H]1CC(=O)NCCCC[C@H](NC(=O)[C@H](Cc2c[nH]c3ccccc23)NC(=O)[C@H](CCCNC(N)=N)NC(=O)[C@@H](Cc2ccc3ccccc3c2)NC(=O)[C@H](Cc2cnc[nH]2)NC1=O)C(N)=O
: