Target
Melanocortin receptor 4
Ligand
BDBM50565819
Substrate
Meas. Tech.
ChEMBL_2093917 (CHEMBL4775180)
Ki
0.015849±n/a nM
Citation
 Martin, CGimenez, LEWilliams, SYJing, YWu, YHollanders, CVan der Poorten, OGonzalez, SVan Holsbeeck, KPreviti, SLamouroux, AZhao, STourwé, DStevens, RCCone, RDBallet, S Structure-Based Design of Melanocortin 4 Receptor Ligands Based on the SHU-9119-hMC4R Cocrystal Structure?. J Med Chem 64:357-369 (2021)  
Target
Name:
Melanocortin receptor 4
Synonyms:
MC4-R MC4R_HUMAN Melanocortin receptor 4 (MC-4) Melanocortin receptor 4 (MC4R)
Type:
Enzyme
Mol. Mass.:
36949.50
Organism:
Homo sapiens (Human)
Description:
P32245
Residue:
332
  
Inhibitor
Name:
BDBM50565819
Synonyms:
CHEMBL4794168
Type:
Small organic molecule
Emp. Form.:
C55H71N17O8
Mol. Mass.:
1098.2613
SMILES:
CCCC[C@H](NC(C)=O)C(=O)N[C@H]1Cc2cn(CCCC[C@H](NC(=O)[C@H](Cc3c[nH]c4ccccc34)NC(=O)[C@H](CCCNC(N)=N)NC(=O)[C@@H](Cc3ccc4ccccc4c3)NC(=O)[C@H](Cc3cnc[nH]3)NC1=O)C(N)=O)nn2
: