Target
Tyrosine-protein kinase Lck
Ligand
BDBM50131117
Substrate
Meas. Tech.
ChEMBL_221480 (CHEMBL842067)
IC50
1.1±n/a nM
Citation
 Das, JMoquin, RVLin, JLiu, CDoweyko, AMDeFex, HFFang, QPang, SPitt, SShen, DRSchieven, GLBarrish, JCWityak, J Discovery of 2-amino-heteroaryl-benzothiazole-6-anilides as potent p56(lck) inhibitors. Bioorg Med Chem Lett 13:2587-90 (2003)  
Target
Name:
Tyrosine-protein kinase Lck
Synonyms:
2.7.10.2 LCK_HUMAN Leukocyte C-terminal Src kinase Lymphocyte-specific protein tyrosine kinase Protein YT16 Proto-oncogene tyrosine-protein kinase LCK T cell-specific protein-tyrosine kinase
Type:
Mol. Mass.:
57987.83
Organism:
Homo sapiens (Human)
Description:
P06239
Residue:
509
  
Inhibitor
Name:
BDBM50131117
Synonyms:
2-[2-(2-Hydroxy-ethylamino)-6-methyl-pyrimidin-4-ylamino]-benzothiazole-6-carboxylic acid (2-chloro-6-methyl-phenyl)-amide | CHEMBL88009
Type:
Small organic molecule
Emp. Form.:
C22H21ClN6O2S
Mol. Mass.:
468.959
SMILES:
Cc1cc(Nc2nc3ccc(cc3s2)C(=O)Nc2c(C)cccc2Cl)nc(NCCO)n1
: