Target
Tyrosine-protein kinase Lck
Ligand
BDBM50131135
Substrate
Meas. Tech.
ChEBML_221493
IC50
8±n/a nM
Citation
 Das, JMoquin, RVLin, JLiu, CDoweyko, AMDeFex, HFFang, QPang, SPitt, SShen, DRSchieven, GLBarrish, JCWityak, J Discovery of 2-amino-heteroaryl-benzothiazole-6-anilides as potent p56(lck) inhibitors. Bioorg Med Chem Lett 13:2587-90 (2003)  
Target
Name:
Tyrosine-protein kinase Lck
Synonyms:
2.7.10.2 LCK_HUMAN Leukocyte C-terminal Src kinase Lymphocyte-specific protein tyrosine kinase Protein YT16 Proto-oncogene tyrosine-protein kinase LCK T cell-specific protein-tyrosine kinase
Type:
Mol. Mass.:
57987.83
Organism:
Homo sapiens (Human)
Description:
P06239
Residue:
509
  
Inhibitor
Name:
BDBM50131135
Synonyms:
2-(4,6-Dimethyl-pyridin-2-ylamino)-benzothiazole-6-carboxylic acid (2-chloro-6-methyl-phenyl)-amide | CHEMBL86392
Type:
Small organic molecule
Emp. Form.:
C22H19ClN4OS
Mol. Mass.:
422.93
SMILES:
Cc1cc(C)nc(Nc2nc3ccc(cc3s2)C(=O)Nc2c(C)cccc2Cl)c1
: