Target
Bcl-2-like protein 1
Ligand
BDBM50566652
Substrate
Meas. Tech.
ChEMBL_2101456 (CHEMBL4809852)
Kd
96±n/a nM
Citation
 Daguer, JPGonse, AShchukin, YFarrera-Soler, LBarluenga, SWinssinger, N Dual Bcl-X Bioorg Med Chem 44:0 (2021)  
Target
Name:
Bcl-2-like protein 1
Synonyms:
Anti-apoptotic Bcl-2 protein Apoptosis regulator Bcl-X BCL2-like 1 isoform 1 BCL2L1 Bcl-2-like protein 1 (Bcl-XL) Bcl-xL/Bcl-2-binding component 3 Bcl2-antagonist of cell death (BAD)
Type:
Mitochondrion membrane; Single-pass membrane protein
Mol. Mass.:
26039.60
Organism:
Homo sapiens (Human)
Description:
Residue:
233
  
Inhibitor
Name:
BDBM50566652
Synonyms:
CHEMBL4871228
Type:
Small organic molecule
Emp. Form.:
C45H51ClN10O9S2
Mol. Mass.:
975.531
SMILES:
[H][C@]12CS[C@@H](CCCCCC(=O)NC(=O)C(CNC(=O)C(NC3=NS(=O)(=O)c4ccccc34)C(C)C)NC(=O)C3(CC3)NC(=O)COc3ccccc3-c3n[nH]c4ccc(Cl)cc34)[C@@]1([H])NC(=O)N2
: