Target
Indoleamine 2,3-dioxygenase 1
Ligand
BDBM50567128
Substrate
Meas. Tech.
ChEMBL_2102391 (CHEMBL4810787)
IC50
0.130000±n/a nM
Citation
 Yu, WDeng, YSloman, DLi, DLiu, KFradera, XLesburg, CAMartinot, TDoty, AFerguson, HRichard Miller, JKnemeyer, IOtte, KVincent, SSciammetta, NJonathan Bennett, DHan, Y Discovery of IDO1 inhibitors containing a decahydroquinoline, decahydro-1,6-naphthyridine, or octahydro-1H-pyrrolo[3,2-c]pyridine scaffold. Bioorg Med Chem Lett 49:0 (2021)  
Target
Name:
Indoleamine 2,3-dioxygenase 1
Synonyms:
I23O1_HUMAN IDO-1 INDO Indoleamine 2,3-dioxygenase | Indoleamine-pyrrole 2,3-dioxygenase
Type:
Enzyme
Mol. Mass.:
45330.80
Organism:
Homo sapiens (Human)
Description:
P14902
Residue:
403
  
Inhibitor
Name:
BDBM50567128
Synonyms:
CHEMBL4855797
Type:
Small organic molecule
Emp. Form.:
C25H28ClFN2O2
Mol. Mass.:
442.953
SMILES:
C[C@H](C1CCC2C(CCCN2C(=O)c2cccc(Cl)c2)C1)C(=O)Nc1ccc(F)cc1
: