Target
Indoleamine 2,3-dioxygenase 1
Ligand
BDBM50567131
Substrate
Meas. Tech.
ChEMBL_2102391 (CHEMBL4810787)
IC50
0.290000±n/a nM
Citation
 Yu, WDeng, YSloman, DLi, DLiu, KFradera, XLesburg, CAMartinot, TDoty, AFerguson, HRichard Miller, JKnemeyer, IOtte, KVincent, SSciammetta, NJonathan Bennett, DHan, Y Discovery of IDO1 inhibitors containing a decahydroquinoline, decahydro-1,6-naphthyridine, or octahydro-1H-pyrrolo[3,2-c]pyridine scaffold. Bioorg Med Chem Lett 49:0 (2021)  
Target
Name:
Indoleamine 2,3-dioxygenase 1
Synonyms:
I23O1_HUMAN IDO-1 INDO Indoleamine 2,3-dioxygenase | Indoleamine-pyrrole 2,3-dioxygenase
Type:
Enzyme
Mol. Mass.:
45330.80
Organism:
Homo sapiens (Human)
Description:
P14902
Residue:
403
  
Inhibitor
Name:
BDBM50567131
Synonyms:
CHEMBL4848630
Type:
Small organic molecule
Emp. Form.:
C25H31FN4O
Mol. Mass.:
422.5382
SMILES:
Cc1nccc(n1)N1CCCC2CC(CCC12)C1(CCC1)C(=O)Nc1ccc(F)cc1
: