Target
Neuronal acetylcholine receptor subunit alpha-3/alpha-6/beta-4
Ligand
BDBM50567432
Substrate
Meas. Tech.
ChEMBL_2103199 (CHEMBL4811702)
IC50
0.280000±n/a nM
Citation
 Hone, AJKaas, QKearns, IHararah, FGajewiak, JChristensen, SCraik, DJMcIntosh, JM Computational and Functional Mapping of Human and Rat ?6?4 Nicotinic Acetylcholine Receptors Reveals Species-Specific Ligand-Binding Motifs. J Med Chem 64:1685-1700 (2021)  
Target
Name:
Neuronal acetylcholine receptor subunit alpha-3/alpha-6/beta-4
Synonyms:
Nicotinic acetylcholine receptor alpha6/alpha3/beta4
Type:
Mol. Mass.:
Description:
ASSAY_ID of ChEMBL is 2103199
Components:
This complex has 3 components.
Component 1
Name:
Neuronal acetylcholine receptor subunit beta-4
Synonyms:
ACHB4_HUMAN Cholinergic, Nicotinic Alpha6Beta3Beta4Alpha5 Nicotinic acetylcholine receptor alpha6/alpha3/beta4
Type:
Enzyme Catalytic Domain
Mol. Mass.:
56388.51
Organism:
Homo sapiens (Human)
Description:
Cholinergic, Nicotinic Alpha6Beta3Beta4Alpha5 0 HUMAN::P30926
Residue:
498
  
Component 2
Name:
Neuronal acetylcholine receptor subunit alpha-3
Synonyms:
ACHA3_HUMAN Cholinergic, Nicotinic Alpha3Beta2 Cholinergic, Nicotinic Alpha3Beta4x NACHRA3 Neuronal acetylcholine receptor subunit alpha-3 nicotinic central
Type:
Enzyme Catalytic Domain
Mol. Mass.:
57479.03
Organism:
Homo sapiens (Human)
Description:
Cholinergic, Nicotinic Alpha3Beta2 0 HUMAN::P32297
Residue:
505
  
Component 3
Name:
Neuronal acetylcholine receptor subunit alpha-6
Synonyms:
ACHA6_HUMAN Neuronal acetylcholine receptor protein alpha-6 subunit
Type:
PROTEIN
Mol. Mass.:
56898.54
Organism:
Homo sapiens (Human)
Description:
EBI_12774
Residue:
494
  
Inhibitor
Name:
BDBM50567432
Synonyms:
CHEMBL4876825
Type:
Small organic molecule
Emp. Form.:
C70H109N25O20S4
Mol. Mass.:
1749.03
SMILES:
CC(C)C[C@@H]1NC(=O)[C@H](CCC(O)=O)NC(=O)[C@@H]2CCCN2C(=O)[C@H](Cc2cnc[nH]2)NC(=O)[C@H](CCCNC(N)=N)NC(=O)[C@@H](NC(=O)[C@H](CC(N)=O)NC(=O)[C@@H]2CSSC[C@H](NC(=O)CN)C(=O)N[C@@H](CSSC[C@H](NC1=O)C(N)=O)C(=O)N[C@@H](CO)C(=O)N[C@@H](Cc1cnc[nH]1)C(=O)N1CCC[C@H]1C(=O)N[C@@H](C(C)C)C(=O)N2)C(C)C
: