Target
Dual specificity mitogen-activated protein kinase kinase 4
Ligand
BDBM50567686
Substrate
Meas. Tech.
ChEMBL_2103768 (CHEMBL4812271)
IC50
146±n/a nM
Citation
 Pfaffenrot, BKlövekorn, PJuchum, MSelig, RAlbrecht, WZender, LLaufer, SA Design and synthesis of 1H-pyrazolo[3,4-b]pyridines targeting mitogen-activated protein kinase kinase 4 (MKK4) - A promising target for liver regeneration. Eur J Med Chem 218:0 (2021)  
Target
Name:
Dual specificity mitogen-activated protein kinase kinase 4
Synonyms:
JNK-activating kinase 1 JNKK1 MAP2K4 MKK4 PRKMK4 SEK1 SKK1 | c-Jun N-terminal kinase kinase 1
Type:
PROTEIN
Mol. Mass.:
44294.29
Organism:
Homo sapiens (Human)
Description:
ChEMBL_1460558
Residue:
399
  
Inhibitor
Name:
BDBM50567686
Synonyms:
CHEMBL4798975
Type:
Small organic molecule
Emp. Form.:
C26H19F2N5O5S2
Mol. Mass.:
583.586
SMILES:
NS(=O)(=O)c1ccc(cc1)-c1cnc2[nH]nc(C(=O)c3c(F)ccc(NS(=O)(=O)Cc4ccccc4)c3F)c2c1
: