Target
Protein kinase C eta type
Ligand
BDBM50132247
Substrate
Meas. Tech.
ChEMBL_161434 (CHEMBL772568)
Ki
6330±n/a nM
Citation
 Nakagawa, YIrie, KYamanaka, NOhigashi, HTsuda, K Synthesis and binding selectivity of 7- and 15-decylbenzolactone-V8 for the C1 domains of protein kinase C isozymes. Bioorg Med Chem Lett 13:3015-9 (2003)  
Target
Name:
Protein kinase C eta type
Synonyms:
KPCL_HUMAN PKCL PRKCL Protein kinase C, PKC; classical/novel | nPKC-eta
Type:
Enzyme
Mol. Mass.:
77844.26
Organism:
Homo sapiens (Human)
Description:
The recombinant human PKC enzymes were produced using a baculovirus expression system in SF9 cells
Residue:
683
  
Inhibitor
Name:
BDBM50132247
Synonyms:
5-Hydroxymethyl-2-isopropyl-1-undecyl-1,2,5,6-tetrahydro-benzo[e][1,4]oxazocin-3-one | CHEMBL102991
Type:
Small organic molecule
Emp. Form.:
C25H41NO3
Mol. Mass.:
403.5979
SMILES:
CCCCCCCCCCCN1[C@@H](C(C)C)C(=O)O[C@H](CO)Cc2ccccc12
: