Target
Proto-oncogene tyrosine-protein kinase Src
Ligand
BDBM50132348
Substrate
Meas. Tech.
ChEBML_202612
IC50
2±n/a nM
Citation
 Vu, CBLuke, GPKawahata, NShakespeare, WCWang, YSundaramoorthi, RMetcalf, CAKeenan, TPPradeepan, SCorpuz, EMerry, TBohacek, RSDalgarno, DCNarula, SSvan Schravendijk, MRRam, MKAdams, SLiou, SKeats, JAViolette, SMGuan, WWeigele, MSawyer, TK Bone-targeted pyrido[2,3-d]pyrimidin-7-ones: potent inhibitors of Src tyrosine kinase as novel antiresorptive agents. Bioorg Med Chem Lett 13:3071-4 (2003)  
Target
Name:
Proto-oncogene tyrosine-protein kinase Src
Synonyms:
Calmodulin/Proto-oncogene tyrosine-protein kinase Src Proto-oncogene c-Src SRC SRC_HUMAN V-src sarcoma (Schmidt-Ruppin A-2) viral oncogene homolog (avian) p60-Src | pp60c-src
Type:
Protein
Mol. Mass.:
59838.60
Organism:
Homo sapiens (Human)
Description:
P12931
Residue:
536
  
Inhibitor
Name:
BDBM50132348
Synonyms:
({4-[6-(2,6-Dichloro-phenyl)-8-methyl-7-oxo-7,8-dihydro-pyrido[2,3-d]pyrimidin-2-ylamino]-phenyl}-hydroxy-phosphinoylmethyl)-phosphonic acid | CHEMBL419360
Type:
Small organic molecule
Emp. Form.:
C21H18Cl2N4O6P2
Mol. Mass.:
555.244
SMILES:
Cn1c2nc(Nc3ccc(cc3)P(O)(=O)CP(O)(O)=O)ncc2cc(-c2c(Cl)cccc2Cl)c1=O
: