Target
Integrase
Ligand
BDBM50132596
Substrate
Meas. Tech.
ChEMBL_90703 (CHEMBL702103)
IC50
81000±n/a nM
Citation
 Krajewski, KLong, YQMarchand, CPommier, YRoller, PP Design and synthesis of dimeric HIV-1 integrase inhibitory peptides. Bioorg Med Chem Lett 13:3203-5 (2003)  
Target
Name:
Integrase
Synonyms:
Human immunodeficiency virus type 1 integrase
Type:
PROTEIN
Mol. Mass.:
32231.48
Organism:
Human immunodeficiency virus 1
Description:
ChEMBL_90865
Residue:
288
  
Inhibitor
Name:
BDBM50132596
Synonyms:
CHEMBL2370434 | Dimeric peptide
Type:
Small organic molecule
Emp. Form.:
C92H110N24O12S2
Mol. Mass.:
1808.141
SMILES:
NCCCC[C@H](NC(=O)[C@H](CSSC[C@H](NC(=O)[C@@H](N)Cc1c[nH]cn1)C(=O)N[C@@H](CCCCN)C(=O)N[C@@H](Cc1ccccc1)C(=O)N[C@@H](Cc1c[nH]c2ccccc12)C(=O)N[C@@H](Cc1c[nH]c2ccccc12)C(N)=O)NC(=O)[C@@H](N)Cc1c[nH]cn1)C(=O)N[C@@H](Cc1ccccc1)C(=O)N[C@@H](Cc1c[nH]c2ccccc12)C(=O)N[C@@H](Cc1c[nH]c2ccccc12)C(N)=O
: