Target
Gonadotropin-releasing hormone receptor
Ligand
BDBM50132732
Substrate
Meas. Tech.
ChEBML_71593
Ki
5±n/a nM
Citation
 Tucci, FCZhu, YFGuo, ZGross, TDConnors, PJStruthers, RSReinhart, GJSaunders, JChen, C Synthesis and structure-activity relationships of 1-arylmethyl-3-(1-methyl-2-amino)ethyl-5-aryl-6-methyluracils as antagonists of the human GnRH Receptor. Bioorg Med Chem Lett 13:3317-22 (2003)  
Target
Name:
Gonadotropin-releasing hormone receptor
Synonyms:
GNRHR GRHR GnRH-R Gonadotropin-releasing hormone receptor | Gonadotropin-releasing hormone receptor (GnRH)
Type:
Enzyme
Mol. Mass.:
37749.45
Organism:
Homo sapiens (Human)
Description:
P30968
Residue:
328
  
Inhibitor
Name:
BDBM50132732
Synonyms:
(S)-1-(2,6-difluorobenzyl)-5-(3-methoxyphenyl)-6-methyl-3-(2-(methyl(2-(pyridin-2-yl)ethyl)amino)propyl)pyrimidine-2,4(1H,3H)-dione CHEMBL111820
Type:
Small organic molecule
Emp. Form.:
C30H32F2N4O3
Mol. Mass.:
534.5969
SMILES:
COc1cccc(c1)-c1c(C)n(Cc2c(F)cccc2F)c(=O)n(C[C@H](C)N(C)CCc2ccccn2)c1=O
: