Target
Corticotropin-releasing factor receptor 1
Ligand
BDBM50132926
Substrate
Meas. Tech.
ChEMBL_51135 (CHEMBL664196)
IC50
15±n/a nM
Citation
 Huang, CQWilcoxen, KMcCarthy, JRHaddach, MGrigoriadis, DChen, C Synthesis of 1-methyl-3-phenylpyrazolo[4,3-b]pyridines via a methylation of 4-phthalimino-3-phenylpyrazoles and optimization toward highly potent corticotropin-releasing factor type-1 antagonists. Bioorg Med Chem Lett 13:3371-4 (2003)  
Target
Name:
Corticotropin-releasing factor receptor 1
Synonyms:
CRF-R CRF1 CRFR1 CRH-R 1 CRHR1 Corticotropin-releasing factor receptor 1 (CRF-1) Corticotropin-releasing hormone receptor 1
Type:
Enzyme
Mol. Mass.:
50744.31
Organism:
Homo sapiens (Human)
Description:
P34998
Residue:
444
  
Inhibitor
Name:
BDBM50132926
Synonyms:
CHEMBL112290 | [3-(2,4-Dichloro-phenyl)-1,5-dimethyl-1H-pyrazolo[4,3-b]pyridin-7-yl]-ethyl-(2-methoxy-ethyl)-amine
Type:
Small organic molecule
Emp. Form.:
C19H22Cl2N4O
Mol. Mass.:
393.31
SMILES:
CCN(CCOC)c1cc(C)nc2c(nn(C)c12)-c1ccc(Cl)cc1Cl
: