Target
Kappa-type opioid receptor
Ligand
BDBM50133051
Substrate
Meas. Tech.
ChEMBL_145690 (CHEMBL753316)
EC50
5.2±n/a nM
Citation
 Vig, BSZheng, MQMurray, TFAldrich, JV Effects of the substitution of Phe4 in the opioid peptide [D-Ala8]dynorphin A-(1-11)NH2. J Med Chem 46:4002-8 (2003)  
Target
Name:
Kappa-type opioid receptor
Synonyms:
KOR-1 OPIATE Kappa Opioid receptor Ror-d
Type:
G Protein-Coupled Receptor (GPCR)
Mol. Mass.:
42692.90
Organism:
Rattus norvegicus (rat)
Description:
P34975
Residue:
380
  
Inhibitor
Name:
BDBM50133051
Synonyms:
CHEMBL413832 | Opioid Peptide [d-Ala(8)]Dynorphin derivative
Type:
Small organic molecule
Emp. Form.:
C61H100N22O12
Mol. Mass.:
1333.5869
SMILES:
CC(C)C[C@H](NC(=O)[C@@H](CCc1ccccc1)NC(=O)CNC(=O)CNC(=O)[C@@H](N)Cc1ccc(O)cc1)C(=O)N[C@@H](CCCNC(N)=N)C(=O)N[C@@H](CCCNC(N)=N)C(=O)N[C@H](C)C(=O)N[C@@H](CCCNC(N)=N)C(=O)N1CCC[C@H]1C(=O)N[C@@H](CCCCN)C(N)=O
: