Target
Glucocorticoid receptor
Ligand
BDBM50133141
Substrate
Meas. Tech.
ChEMBL_71260 (CHEMBL685254)
IC50
188±n/a nM
Citation
 Zhi, LTegley, CMPio, BEdwards, JPMotamedi, MJones, TKMarschke, KBMais, DERisek, BSchrader, WT 5-benzylidene-1,2-dihydrochromeno[3,4-f]quinolines as selective progesterone receptor modulators. J Med Chem 46:4104-12 (2003)  
Target
Name:
Glucocorticoid receptor
Synonyms:
GCR_HUMAN GRL Glucocorticoid receptor (GRFP) Nuclear receptor subfamily 3 group C member 1
Type:
Enzyme
Mol. Mass.:
85656.87
Organism:
Homo sapiens (Human)
Description:
P04150
Residue:
777
  
Inhibitor
Name:
BDBM50133141
Synonyms:
9-Fluoro-2,2,4-trimethyl-5-[1-(3-methyl-pyridin-2-yl)-meth-(Z)-ylidene]-2,5-dihydro-1H-6-oxa-1-aza-chrysene | CHEMBL132363
Type:
Small organic molecule
Emp. Form.:
C26H23FN2O
Mol. Mass.:
398.472
SMILES:
CC1=CC(C)(C)Nc2ccc3-c4cc(F)ccc4O\C(=C/c4ncccc4C)c3c12
: