Target
Histamine H2 receptor
Ligand
BDBM50121205
Substrate
Meas. Tech.
ChEMBL_2106796 (CHEMBL4815471)
Ki
263±n/a nM
Citation
 Biselli, SBresinsky, MTropmann, KForster, LHonisch, CBuschauer, ABernhardt, GPockes, S Pharmacological characterization of a new series of carbamoylguanidines reveals potent agonism at the H Eur J Med Chem 214:0 (2021)  
Target
Name:
Histamine H2 receptor
Synonyms:
Gastric receptor I HISTAMINE H2 HRH2_HUMAN Histamine H2-Gs alpha S
Type:
G Protein-Coupled Receptor (GPCR)
Mol. Mass.:
40115.31
Organism:
Homo sapiens (Human)
Description:
Residue:
359
  
Inhibitor
Name:
BDBM50121205
Synonyms:
CHEBI:18295 | Histamine
Type:
Small organic molecule
Emp. Form.:
C5H9N3
Mol. Mass.:
111.1451
SMILES:
NCCc1c[nH]cn1
: