Target
Histamine H2 receptor
Ligand
BDBM50568751
Substrate
Meas. Tech.
ChEMBL_2106796 (CHEMBL4815471)
Ki
35±n/a nM
Citation
 Biselli, SBresinsky, MTropmann, KForster, LHonisch, CBuschauer, ABernhardt, GPockes, S Pharmacological characterization of a new series of carbamoylguanidines reveals potent agonism at the H Eur J Med Chem 214:0 (2021)  
Target
Name:
Histamine H2 receptor
Synonyms:
Gastric receptor I HISTAMINE H2 HRH2_HUMAN Histamine H2-Gs alpha S
Type:
G Protein-Coupled Receptor (GPCR)
Mol. Mass.:
40115.31
Organism:
Homo sapiens (Human)
Description:
Residue:
359
  
Inhibitor
Name:
BDBM50568751
Synonyms:
CHEMBL4858849
Type:
Small organic molecule
Emp. Form.:
C19H28N6OS
Mol. Mass.:
388.53
SMILES:
CC(C)C(NC(=O)\N=C(/N)NCCCc1sc(N)nc1C)c1ccccc1
: