Target
D(4) dopamine receptor
Ligand
BDBM50362863
Substrate
Meas. Tech.
ChEMBL_2106946 (CHEMBL4815621)
Ki
3.5±n/a nM
Citation
 Ofori, EOnyameh, EKGonela, UMVoshavar, CBricker, BSwanson, TLEshleman, AJSchmachtenberg, JLBloom, SHJanowsky, AJAblordeppey, SY New dual 5-HT1A and 5-HT7 receptor ligands derived from SYA16263. Eur J Med Chem 214:0 (2021)  
Target
Name:
D(4) dopamine receptor
Synonyms:
D(2C) dopamine receptor DOPAMINE D4.2 DRD4 Dopamine D4 receptor
Type:
Enzyme
Mol. Mass.:
48373.19
Organism:
Homo sapiens (Human)
Description:
P21917
Residue:
419
  
Inhibitor
Name:
BDBM50362863
Synonyms:
CHEMBL1940418
Type:
Small organic molecule
Emp. Form.:
C19H24FN3
Mol. Mass.:
313.4124
SMILES:
Fc1ccc(CCCCN2CCN(CC2)c2ccccn2)cc1
: