Target
D(4) dopamine receptor
Ligand
BDBM50036733
Substrate
Meas. Tech.
ChEMBL_2106946 (CHEMBL4815621)
Ki
6.3±n/a nM
Citation
 Ofori, EOnyameh, EKGonela, UMVoshavar, CBricker, BSwanson, TLEshleman, AJSchmachtenberg, JLBloom, SHJanowsky, AJAblordeppey, SY New dual 5-HT1A and 5-HT7 receptor ligands derived from SYA16263. Eur J Med Chem 214:0 (2021)  
Target
Name:
D(4) dopamine receptor
Synonyms:
D(2C) dopamine receptor DOPAMINE D4.2 DRD4 Dopamine D4 receptor
Type:
Enzyme
Mol. Mass.:
48373.19
Organism:
Homo sapiens (Human)
Description:
P21917
Residue:
419
  
Inhibitor
Name:
BDBM50036733
Synonyms:
1-(4-Fluoro-phenyl)-4-(4-pyridin-2-yl-piperazin-1-yl)-butan-1-one(Azaperone) CHEMBL340211
Type:
Small organic molecule
Emp. Form.:
C19H22FN3O
Mol. Mass.:
327.3959
SMILES:
Fc1ccc(cc1)C(=O)CCCN1CCN(CC1)c1ccccn1
: