Target
5-hydroxytryptamine receptor 1A
Ligand
BDBM50568914
Substrate
Meas. Tech.
ChEMBL_2106947 (CHEMBL4815622)
Ki
5.2±n/a nM
Citation
 Ofori, EOnyameh, EKGonela, UMVoshavar, CBricker, BSwanson, TLEshleman, AJSchmachtenberg, JLBloom, SHJanowsky, AJAblordeppey, SY New dual 5-HT1A and 5-HT7 receptor ligands derived from SYA16263. Eur J Med Chem 214:0 (2021)  
Target
Name:
5-hydroxytryptamine receptor 1A
Synonyms:
5-HT-1A 5-hydroxytryptamine receptor 1A (5-HT-1A) ADRB2RL1 Dopamine D2 receptor and serotonin 1a receptor HTR1A | Serotonin receptor 1A
Type:
Mol. Mass.:
46122.49
Organism:
Homo sapiens (Human)
Description:
Residue:
422
  
Inhibitor
Name:
BDBM50568914
Synonyms:
CHEMBL4874069
Type:
Small organic molecule
Emp. Form.:
C22H27N3O
Mol. Mass.:
349.4693
SMILES:
O=C(CCCN1CCN(CC1)c1ccccn1)c1ccc2CCCc2c1
: