Target
5-hydroxytryptamine receptor 1A
Ligand
BDBM50568919
Substrate
Meas. Tech.
ChEMBL_2106947 (CHEMBL4815622)
Ki
4.4±n/a nM
Citation
 Ofori, EOnyameh, EKGonela, UMVoshavar, CBricker, BSwanson, TLEshleman, AJSchmachtenberg, JLBloom, SHJanowsky, AJAblordeppey, SY New dual 5-HT1A and 5-HT7 receptor ligands derived from SYA16263. Eur J Med Chem 214:0 (2021)  
Target
Name:
5-hydroxytryptamine receptor 1A
Synonyms:
5-HT-1A 5-hydroxytryptamine receptor 1A (5-HT-1A) ADRB2RL1 Dopamine D2 receptor and serotonin 1a receptor HTR1A | Serotonin receptor 1A
Type:
Mol. Mass.:
46122.49
Organism:
Homo sapiens (Human)
Description:
Residue:
422
  
Inhibitor
Name:
BDBM50568919
Synonyms:
CHEMBL4857665
Type:
Small organic molecule
Emp. Form.:
C22H26ClN3O
Mol. Mass.:
383.914
SMILES:
Clc1ccc2C(=O)C(CCCCN3CCN(CC3)c3ccccn3)Cc2c1
: