Target
5-hydroxytryptamine receptor 7
Ligand
BDBM50568920
Substrate
Meas. Tech.
ChEMBL_2106950 (CHEMBL4815625)
Ki
8.4±n/a nM
Citation
 Ofori, EOnyameh, EKGonela, UMVoshavar, CBricker, BSwanson, TLEshleman, AJSchmachtenberg, JLBloom, SHJanowsky, AJAblordeppey, SY New dual 5-HT1A and 5-HT7 receptor ligands derived from SYA16263. Eur J Med Chem 214:0 (2021)  
Target
Name:
5-hydroxytryptamine receptor 7
Synonyms:
5-HT-7 5-HT7 5-HT7S 5HT7 HTR7 | Serotonin receptor 7
Type:
G Protein-Coupled Receptor (GPCR)
Mol. Mass.:
53573.08
Organism:
Homo sapiens (Human)
Description:
P34969
Residue:
479
  
Inhibitor
Name:
BDBM50568920
Synonyms:
CHEMBL4846823
Type:
Small organic molecule
Emp. Form.:
C22H26ClN3O
Mol. Mass.:
383.914
SMILES:
CC1(CCCN2CCN(CC2)c2ccccn2)Cc2cc(Cl)ccc2C1=O
: