Target
5-hydroxytryptamine receptor 7
Ligand
BDBM50130293
Substrate
Meas. Tech.
ChEMBL_2106950 (CHEMBL4815625)
Ki
10±n/a nM
Citation
 Ofori, EOnyameh, EKGonela, UMVoshavar, CBricker, BSwanson, TLEshleman, AJSchmachtenberg, JLBloom, SHJanowsky, AJAblordeppey, SY New dual 5-HT1A and 5-HT7 receptor ligands derived from SYA16263. Eur J Med Chem 214:0 (2021)  
Target
Name:
5-hydroxytryptamine receptor 7
Synonyms:
5-HT-7 5-HT7 5-HT7S 5HT7 HTR7 | Serotonin receptor 7
Type:
G Protein-Coupled Receptor (GPCR)
Mol. Mass.:
53573.08
Organism:
Homo sapiens (Human)
Description:
P34969
Residue:
479
  
Inhibitor
Name:
BDBM50130293
Synonyms:
7-{4-[4-(2,3-dichlorophenyl)piperazin-1-yl]butoxy}-3,4-dihydroquinolin-2(1H)-one CHEMBL1112 US10752588, Compound Aripiprazole US9018213, aripprazole | US9156822, Aripiprazole
Type:
Small organic molecule
Emp. Form.:
C23H27Cl2N3O2
Mol. Mass.:
448.385
SMILES:
Clc1cccc(N2CCN(CCCCOc3ccc4CCC(=O)Nc4c3)CC2)c1Cl
: