Target
Gonadotropin-releasing hormone receptor
Ligand
BDBM50133848
Substrate
Meas. Tech.
ChEBML_71591
Ki
170±n/a nM
Citation
 Guo, ZChen, YWu, DZhu, YFStruthers, RSSaunders, JXie, QChen, C Synthesis and structure-activity relationships of thieno[2,3-d]pyrimidine-2,4-dione derivatives as potent GnRH receptor antagonists. Bioorg Med Chem Lett 13:3617-22 (2003)  
Target
Name:
Gonadotropin-releasing hormone receptor
Synonyms:
GNRHR GRHR GnRH-R Gonadotropin-releasing hormone receptor | Gonadotropin-releasing hormone receptor (GnRH)
Type:
Enzyme
Mol. Mass.:
37749.45
Organism:
Homo sapiens (Human)
Description:
P30968
Residue:
328
  
Inhibitor
Name:
BDBM50133848
Synonyms:
1-(2,6-Difluoro-benzyl)-5-[(methyl-phenethyl-amino)-methyl]-6-(4-nitro-phenyl)-3-phenyl-1H-thieno[2,3-d]pyrimidine-2,4-dione CHEMBL120260
Type:
Small organic molecule
Emp. Form.:
C35H28F2N4O4S
Mol. Mass.:
638.683
SMILES:
CN(CCc1ccccc1)Cc1c(sc2n(Cc3c(F)cccc3F)c(=O)n(-c3ccccc3)c(=O)c12)-c1ccc(cc1)[N+]([O-])=O
: