Target
Gonadotropin-releasing hormone receptor
Ligand
BDBM50133850
Substrate
Meas. Tech.
ChEBML_71591
Ki
300±n/a nM
Citation
 Guo, ZChen, YWu, DZhu, YFStruthers, RSSaunders, JXie, QChen, C Synthesis and structure-activity relationships of thieno[2,3-d]pyrimidine-2,4-dione derivatives as potent GnRH receptor antagonists. Bioorg Med Chem Lett 13:3617-22 (2003)  
Target
Name:
Gonadotropin-releasing hormone receptor
Synonyms:
GNRHR GRHR GnRH-R Gonadotropin-releasing hormone receptor | Gonadotropin-releasing hormone receptor (GnRH)
Type:
Enzyme
Mol. Mass.:
37749.45
Organism:
Homo sapiens (Human)
Description:
P30968
Residue:
328
  
Inhibitor
Name:
BDBM50133850
Synonyms:
4-Amino-N-{4-[5-[(benzyl-methyl-amino)-methyl]-1-(2,6-difluoro-benzyl)-2,4-dioxo-3-phenyl-1,2,3,4-tetrahydro-thieno[2,3-d]pyrimidin-6-yl]-phenyl}-butyramide | CHEMBL332616
Type:
Small organic molecule
Emp. Form.:
C38H35F2N5O3S
Mol. Mass.:
679.778
SMILES:
CN(Cc1c(sc2n(Cc3c(F)cccc3F)c(=O)n(-c3ccccc3)c(=O)c12)-c1ccc(NC(=O)CCCN)cc1)Cc1ccccc1
: