Target
Dual specificity protein kinase TTK
Ligand
BDBM50569986
Substrate
Meas. Tech.
ChEMBL_2110865 (CHEMBL4819715)
Kd
7.9±n/a nM
Citation
 Huang, MHuang, YGuo, JYu, LChang, YWang, XLuo, JHuang, YTu, ZLu, XXu, YZhang, ZZhang, ZDing, K Pyrido[2, 3-d]pyrimidin-7(8H)-ones as new selective orally bioavailable Threonine Tyrosine Kinase (TTK) inhibitors. Eur J Med Chem 211:0 (2021)  
Target
Name:
Dual specificity protein kinase TTK
Synonyms:
Dual specificity protein kinase (TTK) MPS1 Monopolar Spindle 1 (MPS1) Monopolar Spindle 1 Kinase (MPS1) TTK | TTK_HUMAN
Type:
Protein
Mol. Mass.:
97086.79
Organism:
Homo sapiens (Human)
Description:
P33981
Residue:
857
  
Inhibitor
Name:
BDBM50569986
Synonyms:
CHEMBL4853433
Type:
Small organic molecule
Emp. Form.:
C31H41N7O3
Mol. Mass.:
559.7023
SMILES:
CCC(=O)N[C@H]1CC[C@H](CC1)n1c2nc(Nc3ccc(cc3OC)N3CCN(C)CC3)ncc2c(cc1=O)C1CC1
: