Target
Dual specificity protein kinase TTK
Ligand
BDBM50569990
Substrate
Meas. Tech.
ChEMBL_2110865 (CHEMBL4819715)
Kd
0.170000±n/a nM
Citation
 Huang, MHuang, YGuo, JYu, LChang, YWang, XLuo, JHuang, YTu, ZLu, XXu, YZhang, ZZhang, ZDing, K Pyrido[2, 3-d]pyrimidin-7(8H)-ones as new selective orally bioavailable Threonine Tyrosine Kinase (TTK) inhibitors. Eur J Med Chem 211:0 (2021)  
Target
Name:
Dual specificity protein kinase TTK
Synonyms:
Dual specificity protein kinase (TTK) MPS1 Monopolar Spindle 1 (MPS1) Monopolar Spindle 1 Kinase (MPS1) TTK | TTK_HUMAN
Type:
Protein
Mol. Mass.:
97086.79
Organism:
Homo sapiens (Human)
Description:
P33981
Residue:
857
  
Inhibitor
Name:
BDBM50569990
Synonyms:
CHEMBL4858486
Type:
Small organic molecule
Emp. Form.:
C33H45N7O3
Mol. Mass.:
587.7555
SMILES:
COc1cc(ccc1Nc1ncc2cc(C)c(=O)n([C@@H]3CC[C@@H](CC3)NC(=O)C3CCCCC3)c2n1)N1CCN(C)CC1
: