Target
Genome polyprotein/Non-structural protein 4A
Ligand
BDBM50135428
Substrate
Meas. Tech.
ChEMBL_143629 (CHEMBL752790)
Ki
12000±n/a nM
Citation
 Perni, RBBritt, SDCourt, JCCourtney, LFDeininger, DDFarmer, LJGates, CAHarbeson, SLKim, JLLandro, JALevin, RBLuong, YPO'Malley, ETPitlik, JRao, BGSchairer, WCThomson, JATung, RDVan Drie, JHWei, Y Inhibitors of hepatitis C virus NS3.4A protease 1. Non-charged tetrapeptide variants. Bioorg Med Chem Lett 13:4059-63 (2003)  
Target
Name:
Genome polyprotein/Non-structural protein 4A
Synonyms:
Hepatitis C virus serine protease, NS3/NS4A
Type:
Mol. Mass.:
Description:
ASSAY_ID of ChEMBL is 1969955
Components:
This complex has 2 components.
Component 1
Name:
Non-structural protein 4A
Synonyms:
Hepatitis C virus NS4A protein Non-structural protein 4A
Type:
PROTEIN
Mol. Mass.:
5762.65
Organism:
Hepatitis C virus
Description:
ChEMBL_305334
Residue:
54
  
Component 2
Name:
Genome polyprotein
Synonyms:
Hepatitis C virus NS3 protease/helicase | Hepatitis C virus serine protease, NS3/NS4A
Type:
Protein
Mol. Mass.:
67067.41
Organism:
Hepatitis C virus
Description:
A3EZI9
Residue:
631
  
Inhibitor
Name:
BDBM50135428
Synonyms:
CHEMBL407674 Pyrazine-2-carboxylic acid ((R)-1-{(R)-1-[(S)-4-benzyloxy-2-((R)-(S)-1-formyl-propylcarbamoyl)-pyrrolidine-1-carbonyl]-2-methyl-propylcarbamoyl}-2-methyl-propyl)-amide
Type:
Small organic molecule
Emp. Form.:
C31H42N6O6
Mol. Mass.:
594.7018
SMILES:
CC[C@H](NC(=O)[C@@H]1C[C@H](CN1C(=O)[C@H](NC(=O)[C@H](NC(=O)c1cnccn1)C(C)C)C(C)C)OCc1ccccc1)C=O
: