Target
Retinoic acid receptor RXR-beta
Ligand
BDBM50135454
Substrate
Meas. Tech.
ChEBML_196926
Ki
17±n/a nM
Citation
 Michellys, PYBoehm, MFChen, JHGrese, TAKaranewsky, DSLeibowitz, MDLiu, SMais, DAMapes, CMReifel-Miller, AOgilvie, KMRungta, DThompson, AWTyhonas, JSYumibe, NArdecky, RJ Design and synthesis of novel RXR-selective modulators with improved pharmacological profile. Bioorg Med Chem Lett 13:4071-5 (2003)  
Target
Name:
Retinoic acid receptor RXR-beta
Synonyms:
NR2B2 RXRB Retinoic acid receptor RXR-beta Retinoid receptor
Type:
PROTEIN
Mol. Mass.:
56932.89
Organism:
Homo sapiens (Human)
Description:
ChEMBL_39045
Residue:
533
  
Inhibitor
Name:
BDBM50135454
Synonyms:
(2E,4E,6Z)-7-(3-Isopropyl-5-pentafluoroethyl-2-propoxy-phenyl)-3-methyl-octa-2,4,6-trienoic acid | CHEMBL132568
Type:
Small organic molecule
Emp. Form.:
C23H27F5O3
Mol. Mass.:
446.4507
SMILES:
CCCOc1c(cc(cc1\C(C)=C/C=C/C(/C)=C/C(O)=O)C(F)(F)C(F)(F)F)C(C)C
: