Target
Glycogen phosphorylase, liver form
Ligand
BDBM50135558
Substrate
Meas. Tech.
ChEBML_70983
IC50
1±n/a nM
Citation
 Lu, ZBohn, JBergeron, RDeng, QEllsworth, KPGeissler, WMHarris, GMcCann, PEMcKeever, BMyers, RWSaperstein, RWilloughby, CAYao, JChapman, K A new class of glycogen phosphorylase inhibitors. Bioorg Med Chem Lett 13:4125-8 (2003)  
Target
Name:
Glycogen phosphorylase, liver form
Synonyms:
Glycogen Phosphorylase (PYGL) Liver glycogen phosphorylase PYGL_HUMAN
Type:
Homodimer
Mol. Mass.:
97153.98
Organism:
Homo sapiens (Human)
Description:
Dimers associate into a tetramer to form the enzymatically active phosphorylase A.
Residue:
847
  
Inhibitor
Name:
BDBM50135558
Synonyms:
4-{3-Fluoro-2-[(4-nitro-pyridine-2-carbonyl)-amino]-phenoxy}-phthalic acid | CHEMBL133911
Type:
Small organic molecule
Emp. Form.:
C20H12FN3O8
Mol. Mass.:
441.323
SMILES:
OC(=O)c1ccc(Oc2cccc(F)c2NC(=O)c2cc(ccn2)[N+]([O-])=O)cc1C(O)=O
: