Target
5-hydroxytryptamine receptor 2A
Ligand
BDBM50208447
Substrate
Meas. Tech.
ChEMBL_2112205 (CHEMBL4821055)
Ki
0.300000±n/a nM
Citation
 Gao, LHao, CChen, JMa, RZheng, LWu, QLiu, XLiu, BFZhang, GChen, YJin, J Discovery of a new class of multi-target heterocycle piperidine derivatives as potential antipsychotics with pro-cognitive effect. Bioorg Med Chem Lett 40:0 (2021)  
Target
Name:
5-hydroxytryptamine receptor 2A
Synonyms:
5-HT-2 5-HT2A 5-hydroxytryptamine receptor 2A (5HT-2A) 5HT2A_HUMAN HTR2A | Serotonin receptor 2A
Type:
undefined
Mol. Mass.:
52607.65
Organism:
Homo sapiens (Human)
Description:
P28223
Residue:
471
  
Inhibitor
Name:
BDBM50208447
Synonyms:
CHEMBL3883955
Type:
Small organic molecule
Emp. Form.:
C25H23F3N4O3
Mol. Mass.:
484.4703
SMILES:
Fc1ccc2c(noc2c1)C1CCN(CCCOc2ccc(=O)n(n2)-c2c(F)cccc2F)CC1
: