Target
5-hydroxytryptamine receptor 6
Ligand
BDBM50208447
Substrate
Meas. Tech.
ChEMBL_2112207 (CHEMBL4821057)
Ki
0.500000±n/a nM
Citation
 Gao, LHao, CChen, JMa, RZheng, LWu, QLiu, XLiu, BFZhang, GChen, YJin, J Discovery of a new class of multi-target heterocycle piperidine derivatives as potential antipsychotics with pro-cognitive effect. Bioorg Med Chem Lett 40:0 (2021)  
Target
Name:
5-hydroxytryptamine receptor 6
Synonyms:
5-HT-6 5-hydroxytryptamine receptor 6 (5-HT-6) 5-hydroxytryptamine receptor 6 (5HT6) HTR6 Serotonin 6 (5-HT6) receptor | Serotonin Receptor 6
Type:
G Protein-Coupled Receptor (GPCR)
Mol. Mass.:
46968.43
Organism:
Homo sapiens (Human)
Description:
P50406
Residue:
440
  
Inhibitor
Name:
BDBM50208447
Synonyms:
CHEMBL3883955
Type:
Small organic molecule
Emp. Form.:
C25H23F3N4O3
Mol. Mass.:
484.4703
SMILES:
Fc1ccc2c(noc2c1)C1CCN(CCCOc2ccc(=O)n(n2)-c2c(F)cccc2F)CC1
: