Target
Histamine H1 receptor
Ligand
BDBM50208447
Substrate
Meas. Tech.
ChEMBL_2112209 (CHEMBL4821059)
Ki
1998±n/a nM
Citation
 Gao, LHao, CChen, JMa, RZheng, LWu, QLiu, XLiu, BFZhang, GChen, YJin, J Discovery of a new class of multi-target heterocycle piperidine derivatives as potential antipsychotics with pro-cognitive effect. Bioorg Med Chem Lett 40:0 (2021)  
Target
Name:
Histamine H1 receptor
Synonyms:
H1R HISTAMINE H1 HRH1_HUMAN
Type:
G Protein-Coupled Receptor (GPCR)
Mol. Mass.:
55808.72
Organism:
Homo sapiens (Human)
Description:
Cell pellets from SK-N-MC cells transfected with human H1 receptor were used in binding assay.
Residue:
487
  
Inhibitor
Name:
BDBM50208447
Synonyms:
CHEMBL3883955
Type:
Small organic molecule
Emp. Form.:
C25H23F3N4O3
Mol. Mass.:
484.4703
SMILES:
Fc1ccc2c(noc2c1)C1CCN(CCCOc2ccc(=O)n(n2)-c2c(F)cccc2F)CC1
: