Target
Prolyl endopeptidase
Ligand
BDBM50135635
Substrate
Meas. Tech.
ChEMBL_157490 (CHEMBL765807)
Ki
0.260000±n/a nM
Citation
 Bal, GVan der Veken, PAntonov, DLambeir, AMGrellier, PCroft, SLAugustyns, KHaemers, A Prolylisoxazoles: potent inhibitors of prolyloligopeptidase with antitrypanosomal activity. Bioorg Med Chem Lett 13:2875-8 (2003)  
Target
Name:
Prolyl endopeptidase
Synonyms:
PE POP PREP Prolyl oligopeptidase
Type:
Enzyme
Mol. Mass.:
80688.50
Organism:
Homo sapiens (Human)
Description:
P48147
Residue:
710
  
Inhibitor
Name:
BDBM50135635
Synonyms:
2-[2-(Isothiazole-3-carbonyl)-pyrrolidine-1-carbonyl]-pyrrolidine-1-carboxylic acid benzyl ester | CHEMBL95698
Type:
Small organic molecule
Emp. Form.:
C21H23N3O4S
Mol. Mass.:
413.49
SMILES:
O=C(OCc1ccccc1)N1CCCC1C(=O)N1CCCC1C(=O)c1ccsn1
: